Mac m1 电脑安装 protubuf 2.5

安装过程中会出现以下错误

fatal error: too many errors emitted, stopping now [-ferror-limit=]
9 warnings and 20 errors generated.
make[2]: *** [atomicops_internals_x86_gcc.lo] Error 1
make[1]: *** [all-recursive] Error 1
make: *** [all] Error 2

完整安装流程

1. 下载安装包

下载地址:https://github.com/protocolbuffers/protobuf/releases/tag/v2.5.0

2. 下载下来后解压压缩包,并进入目录

tar -xzvf protobuf-2.5.0.tar.gz

cd protobuf-2.5.0

3. 编辑 platform_macros.h 文件

文件地址:src/google/protobuf/stubs/platform_macros.h

添加下面信息:

#elif defined(__arm64__)
#define GOOGLE_PROTOBUF_ARCH_ARM 1
#define GOOGLE_PROTOBUF_ARCH_64_BIT 1
  1. 安装检测
make check
  1. 安装及编译
make && make install
  1. 配置环境变量
vim ~/.bash_profile

在文件结尾添加环境变量

export PROTOBUF=/usr/local/protobuf 
export PATH=$PATH:$PROTOBUF/bin
  1. 生效
使用source命令,使配置文件生效

source ~/.bash_profile
  1. 验证
protoc --version

参考文章:

ProtoBuf2.5.0 Mac M1 cpu make failed · Issue #8836 · protocolbuffers/protobuf

推荐阅读更多精彩内容